{"text_format":"1","workbook":"xlsx","n_sheets":8,"sheets":["Investment","FFIUL","FLR-CAP","2Brothers","InvHouse","EquityFunds","Indexes","SP500"],"not_rendered":{"charts":6,"images":6,"macros":1,"external_links":0,"defined_names":1,"comments":0,"pivot_tables":0},"unopened":[],"bounds":{"document_bytes":16777216,"sheet_cells":100000,"rows_first":2000,"rows_last":500,"rows_between":2000,"halvings":0,"cell_chars":16384,"cell_head_chars":4096},"cells_cut":0,"cells_raw":0,"read":"whole","date_system":"1900"}

{"sheet":"Investment","index":0,"n_rows":110,"n_cols":46,"rows_kept":110,"cut":false,"hidden":false,"merged":[[3,4,3,6],[104,33,104,35],[3,7,3,10],[3,33,4,35],[3,32,5,32],[3,26,5,26],[3,19,3,21],[4,21,5,21],[4,22,5,22],[3,23,3,24],[3,18,4,18],[3,39,4,40],[3,27,3,30],[4,27,4,28],[4,29,4,30],[99,32,100,38],[3,36,3,38]]}
[{"$f":"LEFT(H5,FIND(\"/\",H5)-1)/100","v":0.15},{"$f":"RIGHT(H5,LEN(H5)-FIND(\"/\",H5))/100","v":7.4999999999999997E-3}]
["% end@",null,null,null,"F: Roth, historical return, no tax,cost =",null,null,null,null,null,0,"K: FFIUL, historical return"]
[2020,null,null,null,"G: Mutual funcd, historical return, taxed on dividend, cost=",null,null,null,null,null,1E-3,"P: FFIUL, illustration return (fixed)"]
[null,null,null,null,"SP 500",null,null,"SP 500 with CAP / Floor",null,null,null,"Return (Fixed), no cost",null,null,null,"IUL costed",null,null,"years","IUL Participating Loan",null,null,null,"IUL AV",null,null,"Year","Stock Average Return",null,null,null,null,"Year","Annual Returns on Investments",null,null,"Compounded Value of",null,null,"Apply Cap/Floor",null,null,null,"https://www.slickcharts.com/sp500/returns/details"]
["Year","yrs","Monthly Input","Yearly put","%","Acc. Value",-0.33,"15/0.75","Value","IULcost @yr","Value",2.1999999999999999E-2,0.04,0.06,0.08,7.6999999999999999E-2,0.06,null,null,30000,0.06,"Reserve credit difference","Yearly deduct",500000,500000,null,null,"S$P 500",null,"Apply Cap/Floor",null,null,null,null,null,null,1]
["Initial $ ==>",null,null,1000000,null,{"$f":"D6","v":1000000},{"$f":"$D6","v":1000000},0.72199999999999998,{"$f":"$D6","v":1000000},21,{"$f":"$D6","v":1000000},1000000,1000000,1000000,1000000,1000000,{"$f":"D6","v":1000000},null,null,"Balance","Interest",null,null,"With COI","Without COI",null,null,"10 years","20 Years","10 years","20 Years",null,null,"Stocks","T.Bills","T.Bonds","Stocks","T.Bills","T.Bonds","%","$1",null,"Year","Price Return","Dividend Return","Total Return"]
[1928,1,0,-50000,{"$f":"IF($A$7>0,LOOKUP(MOD(B7-1,(A$3-A$7+1))+A$7,AQ$7:AQ$112,AT$7:AT$112),11)/100","v":0.43609999999999999},{"$f":"FV((1+E7-K$2)^(1/12)-1,12,-C7,-(F6+D7),1)","v":1364294.9999999993},{"$f":"FV((1+E7-K$3)^(1/12)-1,12,-C7,-(G6+D7),1) + (G6+D7)*IF($A$7>0,LOOKUP(MOD(B7-1,(A$3-A$7+1))+A$7,AQ$7:AQ$112,AS$7:AS$112),11)/100*$G$5","v":1345381.4500000016},{"$f":"MIN(MAX(IF($A$7>0,LOOKUP(MOD(B7-1,(A$3-A$7+1))+A$7,AQ$7:AQ$112,AR$7:AR$112),11)/100,B$1),A$1) - $H$6/100","v":0.14277999999999999},{"$f":"FV((1+H7)^(1/12)-1,12,-C7,-(I6+D7),1)","v":1085641.0000000002},{"$f":"-OFFSET(FFIUL!Q3:Q67,J$6-1,0,1,1)","v":-2701},{"$f":"FV((1+H7)^(1/12)-1,12,-C7,-(K6+D7+J7),1)","v":1082554.3512200001},{"$f":"FV((1+L$5)^(1/12)-1,12,-$C7,-($M$6+$D7),1)","v":970900.00000000047},{"$f":"FV((1+M$5)^(1/12)-1,12,-$C7,-($M$6+$D7),1)","v":988000.00000000047},{"$f":"FV((1+N$5)^(1/12)-1,12,-$C7,-($D$6+$D7),1)","v":1007000.0000000007},{"$f":"FV((1+O$5)^(1/12)-1,12,-$C7,-($O$6+$D7),1)","v":1025999.9999999999},{"$f":"FV((1+P$5)^(1/12)-1.0006,12,-$C7,-(P6+$D7),1) + FV((1+P$5)^(1/12)-1.0006,12,-J7/12,0,1)","v":1013051.303557075},{"$f":"FV((1+Q$5)^(1/12)-1.0006,12,-$C7,-(Q6+$D7),1) + FV((1+Q$5)^(1/12)-1.0006,12,-J7/12,0,1)","v":997031.26049236266},null,1,{"$f":"T5*(1+U5)","v":31800},{"$f":"T5*U$5","v":1800},{"$f":"(T5+0)*(1+H7)-T7","v":2483.3999999999942},{"$f":"V7","v":2483.3999999999942},{"$f":"IF(X5>T5, FV((1+H7)^(1/12)-1,12,0,-(X5+W7+J7),1), 0)","v":571141.33107200009},{"$f":"IF(Y5>T5,FV((1+H7)^(1/12)-1,12,0,-(Y5+W7),1),0)","v":574227.97985200013},null,1928,null,null,null,null,null,1928,0.43809999999999999,3.0800000000000001E-2,8.3999999999999995E-3,{"$f":"$AK$5*(1+AH7)","v":1.4380999999999999},{"$f":"$AK$5*(1+AI7)","v":1.0307999999999999},{"$f":"$AK$5*(1+AJ7)","v":1.0084},{"$f":"IF(AH7>A$1,A$1,IF(AH7<B$1,B$1,AH7))","v":0.15},{"$f":"1+AN7","v":1.1499999999999999},null,1928,37.880000000000003,5.73,43.61]
[{"$f":"A7+1","v":1929},2,0,-50000,-8.4199999999999997E-2,{"$f":"FV((1+E8-K$2)^(1/12)-1,12,-C8,-(F7+D8),1)","v":1203631.3609999991},1170096.0423003512,2.7999999999999987E-4,{"$f":"FV((1+H8)^(1/12)-1,12,-C8,-(I7+D8),1)","v":1035930.9794799996},{"$f":"-OFFSET(FFIUL!Q4:Q68,J$6-1,0,1,1)","v":-2842},{"$f":"FV((1+H8)^(1/12)-1,12,-C8,-(K7+D8+J8),1)","v":1030000.6706783411},{"$f":"FV((1+L$5)^(1/12)-1,12,-$C8,-(L7+$D8),1)","v":941159.80000000086},{"$f":"FV((1+M$5)^(1/12)-1,12,-$C8,-(M7+$D8),1)","v":975520.00000000093},{"$f":"FV((1+N$5)^(1/12)-1,12,-$C8,-(N7+$D8),1)","v":1014420.0000000014},{"$f":"FV((1+O$5)^(1/12)-1,12,-$C8,-(O7+$D8),1)","v":1054079.9999999998},{"$f":"FV((1+P$5)^(1/12)-1.0006,12,-$C8,-(P7+$D8),1) + FV((1+P$5)^(1/12)-1.0006,12,-J8/12,0,1)","v":1026861.0653554798},{"$f":"FV((1+Q$5)^(1/12)-1.0006,12,-$C8,-(Q7+$D8),1) + FV((1+Q$5)^(1/12)-1.0006,12,-J8/12,0,1)","v":993761.89731310366},null,2,{"$f":"(T7+T$5)*(1+U$5)","v":65508},{"$f":"(T7+T$5)*U$5","v":3708},{"$f":"(T7+T$5)*(1+H8)-T8","v":-3690.6959999999963},{"$f":"V8","v":-3690.6959999999963},{"$f":"IF(X7>T7, FV((1+H8)^(1/12)-1,12,0,-(X7+W8+J8),1), 0)","v":564766.72548981989},{"$f":"IF(Y7>T7,FV((1+H8)^(1/12)-1,12,0,-(Y7+W8),1),0)","v":570697.03429147834},null,1929,null,null,null,null,null,1929,-8.3000000000000004E-2,3.1600000000000003E-2,4.2000000000000003E-2,{"$f":"AK7*(1+AH8)","v":1.3187377},{"$f":"AL7*(1+AI8)","v":1.06337328},{"$f":"AM7*(1+AJ8)","v":1.0507527999999999},7.4999999999999997E-3,{"$f":"AO7*(1+AN8)","v":1.158625},null,1929,-11.91,3.49,-8.42]
{"$rows_left_out":103}
{"sheet":"FFIUL","index":1,"n_rows":76,"n_cols":43,"rows_kept":76,"cut":false,"hidden":false,"merged":[[0,33,0,34],[0,35,0,36],[0,37,0,38],[0,21,0,31]]}
[null,null,null,null,null,null,null,null,null,null,null,null,null,null,null,null,null,null,null,null,null,"FFIUL",null,null,null,null,null,null,null,null,null,null,null,"CD",null,529,null,"Roth 401"]
["AGE","Year","Premium",0.04,"COI","IMAC","PUC","Rider","Fee","Earn","CV","NAR","DB",null,"COST.Total","%CV","Cost","Cum. Cost",null,"AGE","Year","Premium",-0.04,"COI","IAMC","PUC","Rider","Fee","Interest","AV","NAR","DB",null,0.01,0,7.6999999999999999E-2,"AV",{"$f":"AJ2","v":7.6999999999999999E-2},"AV"]
[36,1,24000,960,118,156,2760,0,120,1640,21526,1000000,1021526,null,{"$f":"SUM(D3:I3)","v":4114},{"$f":"O3/K3","v":0.19111771810833411},{"$f":"O3-F3","v":3958},{"$f":"Q3","v":3958},null,36,1,24000,960,118,156,2760,0,120,1640,21526,1000000,1021526,null,{"$f":"V3","v":24000},{"$f":"(AI2+AH3)*(1+AH$2)","v":24240}]
[37,2,24000,960,169,311,2760,0,120,3290,44495,1000000,1044495,null,{"$f":"SUM(D4:I4)","v":4320},9.7089560624789309E-2,{"$f":"O4-F4","v":4009},{"$f":"Q4+R3","v":7967},null,37,2,24000,960,169,311,2760,0,120,3290,44495,1000000,1044495,null,{"$f":"V4","v":24000},{"$f":"(AI3+AH4)*(1+AH$2)","v":48722.400000000001}]
[38,3,24000,960,316,476,2760,0,120,5047,68910,1000000,1068910,null,4632,6.721811057901611E-2,4156,{"$f":"Q5+R4","v":12123},null,38,3,24000,960,316,476,2760,0,120,5047,68910,1000000,1068910,null,24000,73449.623999999996]
[39,4,24000,960,364,652,2760,0,120,6918,94972,1000000,1094972,null,4856,5.1130859621783264E-2,4204,16327,null,39,4,24000,960,364,652,2760,0,120,6918,94972,1000000,1094972,null,24000,98424.120240000004]
[40,5,24000,960,371,839,2760,0,120,8917,122839,1000000,1122839,null,5050,4.1110722164784799E-2,4211,20538,null,40,5,24000,960,371,839,2760,0,120,8917,122839,1000000,1122839,null,24000,123648.36144240001]
[41,6,24000,960,399,1040,2760,0,120,11055,152614,1000000,1152614,null,5279,3.4590535599617334E-2,4239,24777,null,41,6,24000,960,399,1040,2760,0,120,11055,152614,1000000,1152614,null,24000,149124.84505682404]
{"$rows_left_out":69}
{"sheet":"FLR-CAP","index":2,"n_rows":96,"n_cols":43,"rows_kept":96,"cut":false,"hidden":false,"merged":[[10,26,10,28],[10,29,10,31],[2,25,3,25],[10,25,11,25],[1,35,1,37],[2,38,2,39],[1,38,1,39],[1,41,1,42],[2,26,2,28],[2,29,2,31]]}
[]
[null,"year","SP500 ","Price%","AV","10Y ave%","20Y ave%",null,null,null,null,null,null,null,0,"AV","10Y ave%","20Y ave%",null,null,null,null,null,null,null,null,null,null,null,null,null,null,null,null,"Initial AV","SP 500",null,null,"Fixed Return",null,-0.02,"GIUL"]
[null,null,null,null,1,null,null,null,null,null,null,null,null,null,0.12,1,null,null,null,null,null,null,null,null,null,"20 years","S&P500 Average return ",null,null,"Cap/Floor Average return ",null,null,null,null,1000000,null,null,null,{"$f":"AK25","v":4.4575633821567928E-2},null,7.4999999999999997E-3]
[1,{"$f":"Investment!AQ7","v":1928},{"$f":"Investment!AT7/100","v":0.43609999999999999},{"$f":"Investment!AR7/100","v":0.37880000000000003},{"$f":"E3*(1+C4)","v":1.4360999999999999},null,null,null,null,null,null,null,null,null,{"$f":"IF(D4>O$3,O$3,IF(D4<O$2,O$2,D4))","v":0.12},{"$f":"P3*(1+O4)","v":1.1200000000000001},null,null,null,null,null,null,null,null,null,null,"FROM","TO","%","FROM","TO","%",null,null,"Year","%","Acc. Value",-50000,"Acc. Value",{"$f":"AL4","v":-50000},0.15,"Acc. Value",{"$f":"AL4","v":-50000}]
[2,{"$f":"Investment!AQ8","v":1929},{"$f":"Investment!AT8/100","v":-8.4199999999999997E-2},{"$f":"Investment!AR8/100","v":-0.1191},{"$f":"E4*(1+C5)","v":1.3151803799999999},null,null,null,null,null,null,null,null,null,{"$f":"IF(D5>O$3,O$3,IF(D5<O$2,O$2,D5))","v":0},{"$f":"P4*(1+O5)","v":1.1200000000000001},null,null,null,null,null,null,null,null,null,"Min",{"$f":"AB5-20+1","v":1929},{"$f":"INDEX(B$4:B$100,MATCH(AC5,G$4:G$100,0))","v":1948},{"$f":"MIN(G$4:G$100)","v":3.107659564318066E-2},{"$f":"AE5-20+1","v":1929},{"$f":"INDEX(B$4:B$100,MATCH(AF5,R$4:R$100,0))","v":1948},{"$f":"MIN(R$4:R$100)","v":4.6374648548560771E-2},null,1,1930,{"$f":"LOOKUP(AI5,B$4:B$95,C$4:C$95)","v":-0.249},{"$f":"AI3*(1+AJ5)","v":751000},{"$f":"(AI3+AL4)*(1+AJ5)","v":713450},{"$f":"AI3*(1+AM$3)","v":1044575.633821568},{"$f":"(AI$3+AN4)*(1+AM3)","v":992346.85213048954},{"$f":"IF(AJ5>AO$4,AO$4,IF(AJ5<AO$3,AO$3,AJ5))+AO$2","v":-1.2500000000000001E-2},{"$f":"AI3*(1+AO5)","v":987500},{"$f":"(AI3+AQ$4)*(1+AO5)","v":938125}]
[3,{"$f":"Investment!AQ9","v":1930},{"$f":"Investment!AT9/100","v":-0.249},{"$f":"Investment!AR9/100","v":-0.2848},0.98770046537999989,null,null,null,null,null,null,null,null,null,0,1.1200000000000001,null,null,null,null,null,null,null,null,null,0.25,{"$f":"AB6-20+1","v":1996},{"$f":"INDEX(B$4:B$100,MATCH(MIN(K$4:K$100),K$4:K$100,0))","v":2015},{"$f":"QUARTILE(G$4:G$100,1)","v":8.1904985671131025E-2},{"$f":"AE6-20+1","v":1937},{"$f":"INDEX(B$4:B$100,MATCH(MIN(V$4:V$100),V$4:V$100,0))","v":1956},{"$f":"QUARTILE(R$4:R$100,1)","v":6.4849344595665492E-2},null,2,{"$f":"AI5+1","v":1931},-0.43340000000000001,{"$f":"AK5*(1+AJ6)","v":425516.6},{"$f":"(AL5+AL$4)*(1+AJ6)","v":375910.77},{"$f":"AM5*(1+AM$3)","v":1091138.2547737304},{"$f":"(AN5+AN$4)*(1+AM$3)","v":984352.56034396542},{"$f":"IF(AJ6>AO$4,AO$4,IF(AJ6<AO$3,AO$3,AJ6))+AO$2","v":-1.2500000000000001E-2},{"$f":"AP5*(1+AO6)","v":975156.25},{"$f":"(AQ5+AQ$4)*(1+AO6)","v":877023.4375}]
[4,{"$f":"Investment!AQ10","v":1931},{"$f":"Investment!AT10/100","v":-0.43340000000000001},{"$f":"Investment!AR10/100","v":-0.47070000000000001},0.55963108368430792,null,null,null,null,null,null,null,null,null,0,1.1200000000000001,null,null,null,null,null,null,null,null,null,0.5,1968,{"$f":"INDEX(B$4:B$100,MATCH(MIN(L$4:L$100),L$4:L$100,0))","v":1987},{"$f":"MEDIAN(G$4:G$100)","v":0.1144087236359852},1940,{"$f":"INDEX(B$4:B$100,MATCH(MIN(W$4:W$100),W$4:W$100,0))","v":1959},{"$f":"MEDIAN(R$4:R$100)","v":6.9191879787144472E-2},null,3,{"$f":"AI6+1","v":1932},-8.1900000000000001E-2,390666.79045999999,299218.677937,1139776.4340672288,976001.91793410247,-1.2500000000000001E-2,962966.796875,816685.64453125]
[5,{"$f":"Investment!AQ11","v":1932},{"$f":"Investment!AT11/100","v":-8.1900000000000001E-2},{"$f":"Investment!AR11/100","v":-0.14779999999999999},0.51379729793056317,null,null,null,null,null,null,null,null,null,0,1.1200000000000001,null,null,null,null,null,null,null,null,null,0.75,1939,{"$f":"INDEX(B$4:B$100,MATCH(MIN(M$4:M$100),M$4:M$100,0))","v":1958},{"$f":"QUARTILE(G$4:G$100,3)","v":0.13469682810031108},1988,{"$f":"INDEX(B$4:B$100,MATCH(MIN(X$4:X$100),X$4:X$100,0))","v":2007},{"$f":"QUARTILE(R$4:R$100,3)","v":7.2254208742601744E-2},null,4,1933,0.53990000000000005,601587.79062935396,383771.84215518628,1190582.691030662,967279.04034600267,0.13,1088152.48046875,866354.77832031238]
{"$rows_left_out":89}
{"sheet":"2Brothers","index":3,"n_rows":55,"n_cols":16,"rows_kept":55,"cut":false,"hidden":false,"merged":[[2,10,2,13],[20,1,20,5],[54,1,54,6],[54,7,54,8],[45,1,46,8],[51,1,51,3],[51,5,51,7],[52,1,52,3],[52,5,52,7],[53,1,53,4],[53,5,53,8],[47,1,47,8],[48,1,48,4],[48,5,48,8],[49,1,49,3],[49,5,49,7],[50,1,50,3],[50,5,50,7],[24,1,24,8],[4,1,4,8],[5,1,5,6],[6,1,6,6],[7,1,7,6],[5,7,5,8],[6,7,6,8],[21,1,21,8],[11,6,11,8],[25,1,25,4],[25,5,25,8],[27,1,27,3],[26,5,26,7],[27,5,27,7],[1,3,2,8],[8,1,8,4],[8,5,8,8],[20,7,20,8],[3,3,3,8],[13,2,13,4],[14,2,14,4],[16,2,16,4],[7,7,7,8],[13,6,13,8],[11,2,11,4],[12,2,12,4],[12,6,12,8],[16,6,16,8],[14,6,14,8],[9,1,10,4],[28,1,28,3],[28,5,28,7],[26,1,26,3],[17,2,18,4],[17,6,18,8],[19,1,19,8],[38,5,38,7],[29,1,29,8],[34,1,34,8],[32,1,32,4],[33,1,33,4],[30,6,30,8],[31,5,31,8],[30,1,30,4],[31,1,31,4],[32,5,32,8],[33,5,33,8],[1,10,1,13],[9,5,10,8],[43,1,43,6],[43,7,43,8],[42,1,42,4],[42,5,42,8],[39,1,39,3],[40,1,40,3],[40,5,40,7],[39,5,39,7],[41,5,41,7],[41,1,41,3],[36,1,36,8],[37,1,37,4],[37,5,37,8],[38,1,38,3]]}
[]
[null,null,null,"A Tale of Two Brothers",null,null,null,null,null,null,"Initial Investment === >",null,null,null,{"$f":"F15","v":80000},"Fixed "]
[null,null,null,null,null,null,null,null,null,null,"Apply historical stock return, put starting year",null,null,null,1991,{"$f":"IF(G21<1900,G21/100,8%)","v":0.08}]
[null,null,null,"change the green cells for illustration",null,null,null,null,null,null,"Years","Year","Return","Brother B","Value","Value "]
[null,"Our story begins with two brothers, both earn $70K per year",null,null,null,null,null,null,null,null,1,{"$f":"O3","v":1991},{"$f":"IF($O$3>0,LOOKUP($O$3+K5-1,Investment!AQ7:AQ107,Investment!AT7:AT107)/100,11%)","v":0.30469999999999997},{"$f":"((B$17+B$18) * MAX(MIN(12, E$24-(K5-1)*12),0)- F$17 * MAX(MIN(12, I$24-(K5-1)*12),0) )/12","v":-440.91677895447236},{"$f":"FV((1+M5)^(1/12)-1,12,-N5,-O2)","v":98381.530850217372},{"$f":"FV((1+P$3)^(1/12)-1,12,-N5,-O2)","v":80917.690823125624}]
[null,"Each is buying a hourse of a value of:",null,null,null,null,null,800000,null,null,2,{"$f":"L5+1","v":1992},{"$f":"IF($O$3>0,LOOKUP($O$3+K6-1,Investment!AQ8:AQ108,Investment!AT8:AT108)/100,11%)","v":7.6200000000000004E-2},-440.91677895447236,{"$f":"FV((1+M6)^(1/12)-1,12,-N6,-O5)","v":100404.86387874324},{"$f":"FV((1+P$3)^(1/12)-1,12,-N6,-P5)","v":81908.796912101301}]
[null,"Eash has available down payment:",null,null,null,null,null,200000,null,null,3,{"$f":"L6+1","v":1993},{"$f":"IF($O$3>0,LOOKUP($O$3+K7-1,Investment!AQ9:AQ109,Investment!AT9:AT109)/100,11%)","v":0.1008},-440.91677895447236,104994.46656727749,{"$f":"FV((1+P$3)^(1/12)-1,12,-N7,-P6)","v":82979.191488195036}]
[null,"Each tax bracket (Fed + State) is:",null,null,null,null,null,0.33,null,null,4,1994,{"$f":"IF($O$3>0,LOOKUP($O$3+K8-1,Investment!AQ10:AQ110,Investment!AT10:AT110)/100,11%)","v":1.32E-2},-440.91677895447236,101057.45741283258,84135.217630376268]
{"$rows_left_out":48}
{"sheet":"InvHouse","index":4,"n_rows":69,"n_cols":25,"rows_kept":69,"cut":false,"hidden":false,"merged":[[3,16,3,17],[3,19,3,20],[3,22,3,23],[2,0,2,2],[2,4,2,5],[2,16,2,21],[2,22,2,23],[6,26,6,27],[4,0,4,2],[4,4,4,5],[4,16,4,17],[4,19,4,20],[4,22,4,23],[4,8,4,9],[8,20,9,20],[8,24,9,24],[8,26,8,27],[11,27,11,29],[5,4,5,5],[6,9,6,13],[6,1,6,8],[7,17,8,18],[7,19,9,19],[7,21,8,23],[7,26,7,27],[7,7,8,7],[7,6,8,6],[4,26,5,30],[5,17,5,24],[6,17,6,24],[7,8,8,8],[5,0,5,2],[3,0,3,2],[3,4,3,5],[7,1,7,5],[5,8,5,9],[1,0,1,13],[2,11,2,12],[3,11,3,12],[4,11,4,12],[5,11,5,12],[2,7,2,9],[3,7,3,9]]}
[]
["Should You Go For Investing in A House or Investing in MF?"]
["Current Property Price:",null,null,300000,"Monthly Rent Income:",null,1200,"Loan Balance:",null,null,225000,"Income Tax Bracket:",null,0.3,null,null,"Should You Accelerate To Pay Off Mortgage",null,null,null,null,null,"Loan Balance",null,500000]
["Property Appreciation:",null,null,0.03,"Yearly Maintain Cost*",null,0.01,"Loan Interest Rate:",null,null,0.05,"Capital Gain Tax:",null,0.15,null,null,"Interest rate",null,4.4999999999999998E-2,"Monthly payment",null,{"$f":"PMT(S4/12,S5*12,-Y3,0)","v":2533.4265491294036},"Investment return",null,0.12]
["Property Tax:",null,null,5.7000000000000002E-3,"Rent/fee Increase/yr:",null,0.02,"Tax saving:","Years to Pay Off Loan:",null,30,"IUL Cap:",null,0.12,null,null,"Term (years)",null,30,"Monthly addition",null,100,"Tax bracket",null,0.33]
["Selling Cost:",null,null,0.05,"Yearly depreciation:",null,8000,0.24,"Mortgage Montly Payment:",null,{"$f":"PMT(K4/12,K5*12,-K3,0)","v":1207.8486517773129},"IUL Floor:",null,0,null,null,null,"A: Monthly scheduled payment only, invest additions"]
[null,"Invest in the property",null,null,null,null,null,null,null,"Invest down payment + draw monthly income",null,null,null,null,null,null,null,"B: Pay additional to accelerate pay off the mortgage"]
["Year","Monthly",null,null,null,null,"Loan Balance","Property Value","Net value after sell5","Fixed return6","Start year","SP500","With ","IUL cost9",null,null,null,"Loan Balance",null,"A: Invest monthly addition","A-B","Tax Saving on Interest",null,null,"Total A-B"]
{"$rows_left_out":62}
{"sheet":"EquityFunds","index":5,"n_rows":3222,"n_cols":10,"rows_kept":3222,"cut":false,"hidden":false,"merged":[]}
[null,"Family","Fund Name","Net Assets ($MM)","Rtn 20 Yr Load Qtr End","Return 20 Yr","1$ =>"]
[1,"Shelton Greater China Fund              ","Shelton Greater China Fund         ",8.5,-2.59,-3.02,0.54155627900000003,"<==(1+F2/100)^20"]
[2,"Commonwealth Funds                      ","Commonwealth Japan                 ",5.2,-2.2400000000000002,-2.11,0.65277959399999996]
[3,"AIG Funds                               ","AIG Intl Dividend Strat C          ",13.8,-0.56999999999999995,-0.57999999999999996,0.89017455499999998]
[4,"Guggenheim Investments Funds            ","Rydex Precious Metal Investor      ",41.3,-0.17,-0.11,0.97822838999999995,null,null,"Return 20 Yr"]
[5,"AIG Funds                               ","AIG Intl Dividend Strat A          ",72.8,-0.23,0.06,1.012068647,null,"Min",{"$f":"QUARTILE(F$2:F$3220,0)","v":-3.02}]
[6,"Pioneer Investments                     ","Pioneer International Equity C     ",10.4,0.59,0.48,1.100506287,null,0.25,{"$f":"QUARTILE(F$2:F$3220,1)","v":5.72}]
[7,"Saratoga Advantage Trust                ","Saratoga Adv Tr Intl Equity I      ",4.7,0.73,0.74,1.1588812340000001,null,0.5,{"$f":"QUARTILE(F$2:F$3220,2)","v":6.99}]
{"$rows_left_out":3215}
{"sheet":"Indexes","index":6,"n_rows":46,"n_cols":34,"rows_kept":46,"cut":false,"hidden":false,"merged":[]}
[null,null,null,null,null,null,null,null,null,null,null,null,null,null,null,null,null,null,null,null,null,null,"Euro Stoxx 50 Index (SX5E) Yearly Returns",null,null,null,null,null,null,"Hang Seng Index (Hong Kong) Yearly Returns"]
["  Year","  Dow Jones","  S&P500"," NASDAQ","Euro 50","HengSeng","  Dow Jones","  S&P500"," NASDAQ","Euro 50","HengSeng","  Dow Jones","  S&P500"," NASDAQ","Euro 50","HengSeng",null,null,null,null,null,null,"Year","  Beginning Price","  Ending Price","  Gain or Loss","  Percent Gain or Loss",null,null,"Year","  Beginning Price","  Ending Price","  Gain or Loss","  Percent Gain or Loss"]
[1975," 38.32%",0.3155,0.29759999999999998,null,null,null,null,null,null,null,null,null,null,null,null,null,null,null,null,null,null,1987,900.82,648.17999999999995,-252.69,-0.28050000000000003,null,null,1987,2568.3000000000002,2302.8000000000002,-265.5,-0.10340000000000001]
[1976,0.17860000000000001,0.1915,0.26100000000000001,null,null,null,null,null,null,null,null,null,null,null,null,null,null,null,null,null,null,1988,648.17999999999995,861.36,213.23,0.32900000000000001,null,null,1988,2302.8000000000002,2687.4,384.6,0.16700000000000001]
[1977,-0.17269999999999999,-0.115,7.3300000000000004E-2,null,null,null,null,null,null,null,null,null,null,null,null,null,null,null,null,null,null,1989,861.36,1098.49,237.13,0.27529999999999999,null,null,1989,2687.4,2836.6,149.19999999999999,5.5500000000000001E-2]
[1978,-3.15E-2,1.7100000000000001E-2,0.1231,null,null,null,null,null,null,null,null,null,null,null,null,null,null,null,null,null,null,1990,1098.49,858.72,-239.77,-0.21829999999999999,null,null,1990,2836.6,3024,187.4,6.6100000000000006E-2]
[1979,4.19E-2,0.1159,0.28110000000000002,null,null,null,null,null,null,null,null,null,null,null,null,null,null,null,null,null,null,1991,858.72,1000,141.28,0.16450000000000001,null,null,1991,3024,4297.3,1273.3,0.42109999999999997]
[1980,0.14929999999999999,0.25769999999999998,0.33879999999999999,null,null,null,null,null,null,null,"Cap",0.13,null,null,null,null,null,null,null,null,null,1992,1000,1033.51,33.51,3.3500000000000002E-2,null,null,1992,4297.3,5512.4,1215.0999999999999,0.2828]
{"$rows_left_out":39}
{"sheet":"SP500","index":7,"n_rows":51,"n_cols":28,"rows_kept":51,"cut":false,"hidden":false,"merged":[]}
[null,null,null,null,null,null,null,null,null,null,null,null,null,null,"Yearly Invest",null,null,null,null,null,null,null,"Cap","Floor"]
[null,"Period \rEnd","Invest","Income","Capital\r Gain","Reinvest","Taxes\rPaid","Market\r\nValue","Shares","NAV","Cum.P","Tax at Sell","Value",null,15000,null,null,"SP500 Index return without dividends",null,null,"SP500 with dividends",null,0.13,0]
[null,"1997-12-31",0,0,0,0,0,0,0,90.07,{"$f":"0","v":0},0,0,null,null,null,"Year","  Beginning Price","  Ending Price","% Gain or Loss","% Gain or Loss",null,"Without Dividends","With dividends",null,"Without Dividends","With dividends"]
[null,"1998-12-31",10000,147,46,135,58,12658,111,113.95,{"$f":"C4+K3+F4","v":10135},{"$f":"MAX(0.2*(H4-K4),0)","v":504.6},{"$f":"H4-L4","v":12153.4},null,{"$f":"M4*O$2/10000","v":18230.099999999999},null,1975," 68.56",90.19,0.3155,0.37,null,{"$f":"IF(T4>W$2,W$2,IF(T4<X$2,X$2,T4))","v":0.13},{"$f":"IF(U4>W$2,W$2,IF(U4<X$2,X$2,U4))","v":0.13},{"$f":"IF(X4>W4,\"*\",\"\")","v":""},{"$f":"1*(1+W4)","v":1.1299999999999999},{"$f":"1*(1+X4)","v":1.1299999999999999},{"$f":"(1+U4)","v":1.37}]
[null,"1999-12-31",10000,277,195,342,130,26800,198,135.33000000000001,{"$f":"C5+K4+F5","v":20477},{"$f":"MAX(0.2*(H5-K5),0)","v":1264.6000000000001},{"$f":"H5-L5","v":25535.4},null,{"$f":"M5*O$2/10000","v":38303.1},null,1976,90.19,107.46,0.1915,0.23830000000000001,null,{"$f":"IF(T5>W$2,W$2,IF(T5<X$2,X$2,T5))","v":0.13},{"$f":"IF(U5>W$2,W$2,IF(U5<X$2,X$2,U5))","v":0.13},{"$f":"IF(X5>W5,\"*\",\"\")","v":""},{"$f":"Z4*(1+W5)","v":1.2768999999999997},{"$f":"AA4*(1+X5)","v":1.2768999999999997},{"$f":"AB4*(1+U5)","v":1.6964710000000001}]
[null,"2000-12-31",10000,359,0,241,119,33839,278,121.86,30718,624.20000000000005,33214.800000000003,null,49822.200000000004,null,1977,107.46,95.1,-0.115,-6.9800000000000001E-2,null,0,0,"",{"$f":"Z5*(1+W6)","v":1.2768999999999997},{"$f":"AA5*(1+X6)","v":1.2768999999999997},{"$f":"AB5*(1+U6)","v":1.5780573242}]
[null,"2001-12-31",10000,456,0,306,151,38111,360,105.89,41024,0,38111,null,57166.5,null,1978,95.1,96.73,1.7100000000000001E-2,6.5100000000000005E-2,null,1.7100000000000001E-2,6.5100000000000005E-2,"*",1.2987349899999996,1.3600261899999997,1.6807888560054198]
[null,"2002-12-31",10000,622,0,417,205,37378,461,81.150000000000006,51441,0,37378,null,56067,null,1979,96.73,107.94,0.1159,0.1852,null,0.1159,0.13,"*",1.4492583753409993,1.5368295946999995,1.9920709521376236]
{"$rows_left_out":43}